Target
Eukaryotic translation initiation factor 4H
Ligand
BDBM61302
Substrate
Meas. Tech.
uHTS fluorescence polarization assay for the identification of translation initiation inhibitors (eIF4H)
IC50
100000±n/a nM
Citation
 PubChem, PC uHTS fluorescence polarization assay for the identification of translation initiation inhibitors (eIF4H) PubChem Bioassay (2009)[AID] 
Target
Name:
Eukaryotic translation initiation factor 4H
Synonyms:
EIF4H KIAA0038 WSCR1
Type:
Enzyme Catalytic Domain
Mol. Mass.:
27385.24
Organism:
Homo sapiens (Human)
Description:
Q15056
Residue:
248
  
Inhibitor
Name:
BDBM61302
Synonyms:
(6E)-6-[(1-pyridin-1-iumylamino)methylidene]-1-cyclohexa-2,4-dienone;iodide (6E)-6-[(pyridin-1-ium-1-ylamino)methylidene]cyclohexa-2,4-dien-1-one;iodide SMR000364324 | cid_16196781
Type:
Small organic molecule
Emp. Form.:
C12H11N2O
Mol. Mass.:
199.228
SMILES:
Oc1ccccc1C=N[n+]1ccccc1
: