Target
Eukaryotic translation initiation factor 4H
Ligand
BDBM61315
Substrate
Meas. Tech.
uHTS fluorescence polarization assay for the identification of translation initiation inhibitors (eIF4H)
IC50
100000±n/a nM
Citation
 PubChem, PC uHTS fluorescence polarization assay for the identification of translation initiation inhibitors (eIF4H) PubChem Bioassay (2009)[AID] 
Target
Name:
Eukaryotic translation initiation factor 4H
Synonyms:
EIF4H KIAA0038 WSCR1
Type:
Enzyme Catalytic Domain
Mol. Mass.:
27385.24
Organism:
Homo sapiens (Human)
Description:
Q15056
Residue:
248
  
Inhibitor
Name:
BDBM61315
Synonyms:
Diethyl-{5-hydroxy-4-[(E)-hydroxyimino]-5,5-diphenyl-pentyl}-methyl-ammonium SMR000429446 diethyl-(4-hydroximino-5-hydroxy-5,5-diphenyl-pentyl)-methyl-ammonium;iodide diethyl-(5-hydroxy-4-hydroxyimino-5,5-diphenylpentyl)-methylammonium;iodide | diethyl-(5-hydroxy-4-hydroxyimino-5,5-diphenylpentyl)-methylazanium;iodide
Type:
Small organic molecule
Emp. Form.:
C22H31N2O2
Mol. Mass.:
355.4932
SMILES:
CC[N+](C)(CC)CCCC(N=O)C(O)(c1ccccc1)c1ccccc1
: