Target
Eukaryotic translation initiation factor 4H
Ligand
BDBM61363
Substrate
Meas. Tech.
uHTS fluorescence polarization assay for the identification of translation initiation inhibitors (eIF4H)
IC50
100000±n/a nM
Citation
 PubChem, PC uHTS fluorescence polarization assay for the identification of translation initiation inhibitors (eIF4H) PubChem Bioassay (2009)[AID] 
Target
Name:
Eukaryotic translation initiation factor 4H
Synonyms:
EIF4H KIAA0038 WSCR1
Type:
Enzyme Catalytic Domain
Mol. Mass.:
27385.24
Organism:
Homo sapiens (Human)
Description:
Q15056
Residue:
248
  
Inhibitor
Name:
BDBM61363
Synonyms:
(4S)-2-[3-(diethylamino)propylamino]-1-ethyl-6-methyl-4-phenyl-4H-pyrimidine-5-carboxylic acid methyl ester SMR000672075 methyl (4S)-2-[3-(diethylamino)propylamino]-1-ethyl-6-methyl-4-phenyl-4H-pyrimidine-5-carboxylate
Type:
Small organic molecule
Emp. Form.:
C22H34N4O2
Mol. Mass.:
386.531
SMILES:
CCN(CC)CCCN=C1N[C@H](C(C(=O)OC)=C(C)N1CC)c1ccccc1
: