Target
Eukaryotic translation initiation factor 4H
Ligand
BDBM61364
Substrate
Meas. Tech.
uHTS fluorescence polarization assay for the identification of translation initiation inhibitors (eIF4H)
IC50
100000±n/a nM
Citation
 PubChem, PC uHTS fluorescence polarization assay for the identification of translation initiation inhibitors (eIF4H) PubChem Bioassay (2009)[AID] 
Target
Name:
Eukaryotic translation initiation factor 4H
Synonyms:
EIF4H KIAA0038 WSCR1
Type:
Enzyme Catalytic Domain
Mol. Mass.:
27385.24
Organism:
Homo sapiens (Human)
Description:
Q15056
Residue:
248
  
Inhibitor
Name:
BDBM61364
Synonyms:
(4R,5R,6R)-1-ethyl-6-methyl-4-phenyl-2-[(3,4,5-trimethoxybenzyl)amino]-5,6-dihydro-4H-pyrimidine-5-carboxylic acid methyl ester MLS000829852 cid_24789238 | methyl (4R,5R,6R)-1-ethyl-6-methyl-4-phenyl-2-[(3,4,5-trimethoxyphenyl)methylamino]-5,6-dihydro-4H-pyrimidine-5-carboxylate
Type:
Small organic molecule
Emp. Form.:
C25H33N3O5
Mol. Mass.:
455.5466
SMILES:
CCN1[C@H](C)[C@H]([C@@H](N=C1NCc1cc(OC)c(OC)c(OC)c1)c1ccccc1)C(=O)OC
: