Target
G-protein coupled receptor 55
Ligand
BDBM44616
Substrate
Meas. Tech.
Image-Based HTS for Selective Antagonists for GPR55
IC50
624.4749±n/a nM
Citation
 PubChem, PC Image-Based HTS for Selective Antagonists for GPR55 PubChem Bioassay (2010)[AID] 
Target
Name:
G-protein coupled receptor 55
Synonyms:
G protein-coupled receptor 55 GPR55_HUMAN
Type:
PROTEIN
Mol. Mass.:
36649.72
Organism:
Homo sapiens (Human)
Description:
ChEMBL_1292265
Residue:
319
  
Inhibitor
Name:
BDBM44616
Synonyms:
3-[(E)-cinnamyl]-9-(4-fluorophenyl)-1-methyl-7,8-dihydro-6H-purino[7,8-a]pyrimidine-2,4-quinone MLS000083685 cid_5390009
Type:
Small organic molecule
Emp. Form.:
C24H22FN5O2
Mol. Mass.:
431.4622
SMILES:
Cn1c2nc3N(CCCn3c2c(=O)n(C\C=C\c2ccccc2)c1=O)c1ccc(F)cc1
: