Target
Polyadenylate-binding protein 1
Ligand
BDBM61268
Substrate
Meas. Tech.
uHTS fluorescence polarization assay for the identification of translation initiation inhibitors (PABP)
IC50
7330±n/a nM
Citation
 PubChem, PC uHTS fluorescence polarization assay for the identification of translation initiation inhibitors (PABP) PubChem Bioassay (2009)[AID] 
Target
Name:
Polyadenylate-binding protein 1
Synonyms:
PAB1 PABP1 PABPC1 poly(A) binding protein, cytoplasmic 1 | polyadenylate-binding protein 1
Type:
Enzyme Catalytic Domain
Mol. Mass.:
70694.26
Organism:
Homo sapiens (Human)
Description:
gi_46367787
Residue:
636
  
Inhibitor
Name:
BDBM61268
Synonyms:
1-methyl-4-(4-pyridyl)pyridin-1-ium;iodide 1-methyl-4-pyridin-4-ylpyridin-1-ium;iodide SMR000057824 | cid_38115
Type:
Small organic molecule
Emp. Form.:
C11H11N2
Mol. Mass.:
171.2179
SMILES:
C[n+]1ccc(cc1)-c1ccncc1
: