Target
Polyadenylate-binding protein 1
Ligand
BDBM61278
Substrate
Meas. Tech.
uHTS fluorescence polarization assay for the identification of translation initiation inhibitors (PABP)
IC50
7075±n/a nM
Citation
 PubChem, PC uHTS fluorescence polarization assay for the identification of translation initiation inhibitors (PABP) PubChem Bioassay (2009)[AID] 
Target
Name:
Polyadenylate-binding protein 1
Synonyms:
PAB1 PABP1 PABPC1 poly(A) binding protein, cytoplasmic 1 | polyadenylate-binding protein 1
Type:
Enzyme Catalytic Domain
Mol. Mass.:
70694.26
Organism:
Homo sapiens (Human)
Description:
gi_46367787
Residue:
636
  
Inhibitor
Name:
BDBM61278
Synonyms:
MLS000594062 N-[3-[5-[2-(tert-butylamino)-2-oxidanylidene-ethyl]sulfanyl-4-methyl-1,2,4-triazol-3-yl]phenyl]-2-fluoranyl-benzamide N-[3-[5-[[2-(tert-butylamino)-2-keto-ethyl]thio]-4-methyl-1,2,4-triazol-3-yl]phenyl]-2-fluoro-benzamide SMR000143121 | cid_2185008
Type:
Small organic molecule
Emp. Form.:
C22H24FN5O2S
Mol. Mass.:
441.522
SMILES:
Cn1c(SCC(=O)NC(C)(C)C)nnc1-c1cccc(NC(=O)c2ccccc2F)c1
: