Target
Polyadenylate-binding protein 1
Ligand
BDBM61287
Substrate
Meas. Tech.
uHTS fluorescence polarization assay for the identification of translation initiation inhibitors (PABP)
IC50
100000±n/a nM
Citation
 PubChem, PC uHTS fluorescence polarization assay for the identification of translation initiation inhibitors (PABP) PubChem Bioassay (2009)[AID] 
Target
Name:
Polyadenylate-binding protein 1
Synonyms:
PAB1 PABP1 PABPC1 poly(A) binding protein, cytoplasmic 1 | polyadenylate-binding protein 1
Type:
Enzyme Catalytic Domain
Mol. Mass.:
70694.26
Organism:
Homo sapiens (Human)
Description:
gi_46367787
Residue:
636
  
Inhibitor
Name:
BDBM61287
Synonyms:
2-(benzyloxycarbonylamino)-3-phenyl-propionic acid [2-keto-4-(trifluoromethyl)chromen-7-yl] ester 3-phenyl-2-(phenylmethoxycarbonylamino)propanoic acid [2-oxo-4-(trifluoromethyl)-1-benzopyran-7-yl] ester SMR000211943 [2-oxo-4-(trifluoromethyl)chromen-7-yl] 3-phenyl-2-(phenylmethoxycarbonylamino)propanoate | cid_3768880
Type:
Small organic molecule
Emp. Form.:
C27H20F3NO6
Mol. Mass.:
511.446
SMILES:
FC(F)(F)c1cc(=O)oc2cc(OC(=O)C(Cc3ccccc3)NC(=O)OCc3ccccc3)ccc12
: