Target
Polyadenylate-binding protein 1
Ligand
BDBM61298
Substrate
Meas. Tech.
uHTS fluorescence polarization assay for the identification of translation initiation inhibitors (PABP)
IC50
11150±n/a nM
Citation
 PubChem, PC uHTS fluorescence polarization assay for the identification of translation initiation inhibitors (PABP) PubChem Bioassay (2009)[AID] 
Target
Name:
Polyadenylate-binding protein 1
Synonyms:
PAB1 PABP1 PABPC1 poly(A) binding protein, cytoplasmic 1 | polyadenylate-binding protein 1
Type:
Enzyme Catalytic Domain
Mol. Mass.:
70694.26
Organism:
Homo sapiens (Human)
Description:
gi_46367787
Residue:
636
  
Inhibitor
Name:
BDBM61298
Synonyms:
MLS000718815 N-(2-methyl-1,3-benzothiazol-6-yl)-2,3-dihydro-1,4-benzodioxine-3-carboxamide cid_3162265
Type:
Small organic molecule
Emp. Form.:
C17H14N2O3S
Mol. Mass.:
326.37
SMILES:
Cc1nc2ccc(NC(=O)C3COc4ccccc4O3)cc2s1
: