Target
Polyadenylate-binding protein 1
Ligand
BDBM61353
Substrate
Meas. Tech.
uHTS fluorescence polarization assay for the identification of translation initiation inhibitors (PABP)
IC50
6805±n/a nM
Citation
 PubChem, PC uHTS fluorescence polarization assay for the identification of translation initiation inhibitors (PABP) PubChem Bioassay (2009)[AID] 
Target
Name:
Polyadenylate-binding protein 1
Synonyms:
PAB1 PABP1 PABPC1 poly(A) binding protein, cytoplasmic 1 | polyadenylate-binding protein 1
Type:
Enzyme Catalytic Domain
Mol. Mass.:
70694.26
Organism:
Homo sapiens (Human)
Description:
gi_46367787
Residue:
636
  
Inhibitor
Name:
BDBM61353
Synonyms:
2-[(E)-(3-bromo-4-hydroxy-5-methylphenyl)(3-bromo-5-methyl-4-oxocyclohexa-2,5-dien-1-ylidene)methyl]benzenesulfonate SMR000554428 ammonium;2-[(E)-(3-bromo-4-hydroxy-5-methylphenyl)-(3-bromo-5-methyl-4-oxo-1-cyclohexa-2,5-dienylidene)methyl]benzenesulfonate azanium;2-[(E)-(3-bromo-4-hydroxy-5-methylphenyl)-(3-bromo-5-methyl-4-oxocyclohexa-2,5-dien-1-ylidene)methyl]benzenesulfonate | cid_18552900
Type:
Small organic molecule
Emp. Form.:
C21H15Br2O5S
Mol. Mass.:
539.214
SMILES:
CC1=C\C(C=C(Br)C1=O)=C(\c1cc(C)c(O)c(Br)c1)c1ccccc1S([O-])(=O)=O
: