Target
Polyadenylate-binding protein 1
Ligand
BDBM61361
Substrate
Meas. Tech.
uHTS fluorescence polarization assay for the identification of translation initiation inhibitors (PABP)
IC50
10020±n/a nM
Citation
 PubChem, PC uHTS fluorescence polarization assay for the identification of translation initiation inhibitors (PABP) PubChem Bioassay (2009)[AID] 
Target
Name:
Polyadenylate-binding protein 1
Synonyms:
PAB1 PABP1 PABPC1 poly(A) binding protein, cytoplasmic 1 | polyadenylate-binding protein 1
Type:
Enzyme Catalytic Domain
Mol. Mass.:
70694.26
Organism:
Homo sapiens (Human)
Description:
gi_46367787
Residue:
636
  
Inhibitor
Name:
BDBM61361
Synonyms:
(4S)-1-ethyl-2-(isobutylamino)-6-methyl-4-[3-(trifluoromethyl)phenyl]-4H-pyrimidine-5-carboxylic acid methyl ester MLS000830368 cid_24789232 | methyl (4S)-1-ethyl-6-methyl-2-(2-methylpropylamino)-4-[3-(trifluoromethyl)phenyl]-4H-pyrimidine-5-carboxylate
Type:
Small organic molecule
Emp. Form.:
C20H26F3N3O2
Mol. Mass.:
397.4345
SMILES:
CCN1C(C)=C([C@@H](N=C1NCC(C)C)c1cccc(c1)C(F)(F)F)C(=O)OC
: