Target
G-protein coupled receptor 35
Ligand
BDBM61633
Substrate
Meas. Tech.
Image-Based HTS for Selective Antagonists of GPR35
IC50
1004.129±n/a nM
Citation
 PubChem, PC Image-Based HTS for Selective Antagonists of GPR35 PubChem Bioassay (2010)[AID] 
Target
Name:
G-protein coupled receptor 35
Synonyms:
G protein-coupled receptor 35 GPR35_HUMAN
Type:
Enzyme Catalytic Domain
Mol. Mass.:
34085.57
Organism:
Homo sapiens (Human)
Description:
gi_33695097
Residue:
309
  
Inhibitor
Name:
BDBM61633
Synonyms:
2-[[3-[(4-amoxycarbonylphenyl)carbamoyl]phenyl]carbamoyl]benzoic acid 2-[oxo-[3-[oxo-[4-[oxo(pentoxy)methyl]anilino]methyl]anilino]methyl]benzoic acid SMR000514432 cid_3110120
Type:
Small organic molecule
Emp. Form.:
C27H26N2O6
Mol. Mass.:
474.5051
SMILES:
CCCCCOC(=O)c1ccc(NC(=O)c2cccc(NC(=O)c3ccccc3C(O)=O)c2)cc1
: