Target
G-protein coupled receptor 35
Ligand
BDBM61642
Substrate
Meas. Tech.
Image-Based HTS for Selective Antagonists of GPR35
IC50
2065.542±n/a nM
Citation
 PubChem, PC Image-Based HTS for Selective Antagonists of GPR35 PubChem Bioassay (2010)[AID] 
Target
Name:
G-protein coupled receptor 35
Synonyms:
G protein-coupled receptor 35 GPR35_HUMAN
Type:
Enzyme Catalytic Domain
Mol. Mass.:
34085.57
Organism:
Homo sapiens (Human)
Description:
gi_33695097
Residue:
309
  
Inhibitor
Name:
BDBM61642
Synonyms:
MLS001030562 N-(2,3-dihydro-1,4-benzodioxin-6-yl)-2,5-dimethyl-4-piperidin-1-yl-thieno[2,3-d]pyrimidine-6-carboxamide N-(2,3-dihydro-1,4-benzodioxin-6-yl)-2,5-dimethyl-4-piperidino-thieno[2,3-d]pyrimidine-6-carboxamide cid_4557537
Type:
Small organic molecule
Emp. Form.:
C22H24N4O3S
Mol. Mass.:
424.516
SMILES:
Cc1c(sc2nc(C)nc(N3CCCCC3)c12)C(=O)Nc1ccc2OCCOc2c1
: