Target
Voltage-dependent N-type calcium channel subunit alpha-1B
Ligand
BDBM50582
Substrate
Meas. Tech.
Homogeneous Time-Resolved Fluorescence Resonance Energy Transfer (HTRF) Assay
IC50
2590±n/a nM
Citation
 PubChem, PC Homogeneous Time-Resolved Fluorescence Resonance Energy Transfer (HTRF) Assay PubChem Bioassay (2009)[AID] 
Target
Name:
Voltage-dependent N-type calcium channel subunit alpha-1B
Synonyms:
BIII CAC1B_HUMAN CACNA1B Calcium channel (Type N) Voltage-dependent N-type calcium channel subunit alpha-1B Voltage-gated N-type calcium channel alpha-1B subunit Voltage-gated calcium channel Voltage-gated calcium channel subunit alpha Cav2.2 ((alpha 1B, beta 1b, alpha 2 delta-1) | calcium channel, voltage-dependent, N type, alpha 1B subunit
Type:
Enzyme
Mol. Mass.:
262548.16
Organism:
Homo sapiens (Human)
Description:
Q00975
Residue:
2339
  
Inhibitor
Name:
BDBM50582
Synonyms:
2-(2-furanyl)-N-[4-methoxy-3-(4-morpholinylsulfonyl)phenyl]-4-quinolinecarboxamide 2-(furan-2-yl)-N-(4-methoxy-3-morpholin-4-ylsulfonyl-phenyl)quinoline-4-carboxamide MLS001002794 cid_3612347
Type:
Small organic molecule
Emp. Form.:
C25H23N3O6S
Mol. Mass.:
493.532
SMILES:
COc1ccc(NC(=O)c2cc(nc3ccccc23)-c2ccco2)cc1S(=O)(=O)N1CCOCC1
: