Target
Muscarinic acetylcholine receptor M1
Ligand
BDBM50305817
Substrate
Meas. Tech.
Discovery of Novel Allosteric Modulators of the Muscarinic Receptor M5: Calcium Flux Assay
EC50
13200±n/a nM
Citation
 PubChem, PC Discovery of Novel Allosteric Modulators of the Muscarinic Receptor M5: Calcium Flux Assay PubChem Bioassay (2010)[AID] 
Target
Name:
Muscarinic acetylcholine receptor M1
Synonyms:
ACM1_RAT Chrm-1 cholinergic receptor, muscarinic 1
Type:
Enzyme Catalytic Domain
Mol. Mass.:
51390.46
Organism:
RAT
Description:
P08482
Residue:
460
  
Inhibitor
Name:
BDBM50305817
Synonyms:
1-(4-phenoxybenzyl)-5-(trifluoromethoxy)indoline-2,3-dione cid_44602489
Type:
Small organic molecule
Emp. Form.:
C22H14F3NO4
Mol. Mass.:
413.3461
SMILES:
FC(F)(F)Oc1ccc2N(Cc3ccc(Oc4ccccc4)cc3)C(=O)C(=O)c2c1
: