Target
Neuropeptide Y receptor type 2
Ligand
BDBM58038
Substrate
Meas. Tech.
Fluorescence counterscreen for potentiators or agonists of NPY-Y1: Cell-based high-throughput dose response assay for potentiators or agonists of NPY-Y2.
EC50
12019±n/a nM
Citation
 PubChem, PC Fluorescence counterscreen for potentiators or agonists of NPY-Y1: Cell-based high-throughput dose response assay for potentiators or agonists of NPY-Y2. PubChem Bioassay (2009)[AID] 
Target
Name:
Neuropeptide Y receptor type 2
Synonyms:
NPY-Y2 NPY2-R NPY2R_HUMAN Y2 receptor | neuropeptide Y receptor Y2
Type:
Enzyme Catalytic Domain
Mol. Mass.:
42734.65
Organism:
Homo sapiens (Human)
Description:
NPY-Y2 NPY2R HUMAN::P49146
Residue:
381
  
Inhibitor
Name:
BDBM58038
Synonyms:
2-(3-Bromo-phenyl)-3-(4-chloro-phenyl)-1H-imidazo[4,5-b]quinoxaline MLS001012274 cid_5604367
Type:
Small organic molecule
Emp. Form.:
C21H13BrClN4
Mol. Mass.:
436.711
SMILES:
Clc1ccc(cc1)-[n+]1c([nH]c2nc3ccccc3nc12)-c1cccc(Br)c1
: