Target
Neuropeptide Y receptor type 2
Ligand
BDBM39446
Substrate
Meas. Tech.
Fluorescence-based cell-based high-throughput dose response assay for agonists of NPY-Y2.
EC50
>35430±n/a nM
Citation
 PubChem, PC Fluorescence-based cell-based high-throughput dose response assay for agonists of NPY-Y2. PubChem Bioassay (2009)[AID] 
Target
Name:
Neuropeptide Y receptor type 2
Synonyms:
NPY-Y2 NPY2-R NPY2R_HUMAN Y2 receptor | neuropeptide Y receptor Y2
Type:
Enzyme Catalytic Domain
Mol. Mass.:
42734.65
Organism:
Homo sapiens (Human)
Description:
NPY-Y2 NPY2R HUMAN::P49146
Residue:
381
  
Inhibitor
Name:
BDBM39446
Synonyms:
MLS000036584 N-[4-(1-benzofuran-2-yl)phenyl]ethanamide N-[4-(benzofuran-2-yl)phenyl]acetamide cid_660707
Type:
Small organic molecule
Emp. Form.:
C16H13NO2
Mol. Mass.:
251.2799
SMILES:
CC(=O)Nc1ccc(cc1)-c1cc2ccccc2o1
: