Target
Neuropeptide Y receptor type 2
Ligand
BDBM61793
Substrate
Meas. Tech.
Fluorescence-based cell-based high-throughput dose response assay for agonists of NPY-Y2.
EC50
>35430±n/a nM
Citation
 PubChem, PC Fluorescence-based cell-based high-throughput dose response assay for agonists of NPY-Y2. PubChem Bioassay (2009)[AID] 
Target
Name:
Neuropeptide Y receptor type 2
Synonyms:
NPY-Y2 NPY2-R NPY2R_HUMAN Y2 receptor | neuropeptide Y receptor Y2
Type:
Enzyme Catalytic Domain
Mol. Mass.:
42734.65
Organism:
Homo sapiens (Human)
Description:
NPY-Y2 NPY2R HUMAN::P49146
Residue:
381
  
Inhibitor
Name:
BDBM61793
Synonyms:
5-[(3Z)-3-(4-hydroxy-6-keto-3-propyl-cyclohexa-2,4-dien-1-ylidene)-3-pyrazolin-4-yl]furan-2-carboxylic acid ethyl ester MLS000055604 cid_5428930 ethyl 5-[(3Z)-3-(4-oxidanyl-6-oxidanylidene-3-propyl-cyclohexa-2,4-dien-1-ylidene)-1,2-dihydropyrazol-4-yl]furan-2-carboxylate
Type:
Small organic molecule
Emp. Form.:
C19H20N2O5
Mol. Mass.:
356.3725
SMILES:
CCCc1cc(-c2n[nH]cc2-c2ccc(o2)C(=O)OCC)c(O)cc1O
: