Target
Neuropeptide Y receptor type 2
Ligand
BDBM61799
Substrate
Meas. Tech.
Fluorescence-based cell-based high-throughput dose response assay for agonists of NPY-Y2.
EC50
>35430±n/a nM
Citation
 PubChem, PC Fluorescence-based cell-based high-throughput dose response assay for agonists of NPY-Y2. PubChem Bioassay (2009)[AID] 
Target
Name:
Neuropeptide Y receptor type 2
Synonyms:
NPY-Y2 NPY2-R NPY2R_HUMAN Y2 receptor | neuropeptide Y receptor Y2
Type:
Enzyme Catalytic Domain
Mol. Mass.:
42734.65
Organism:
Homo sapiens (Human)
Description:
NPY-Y2 NPY2R HUMAN::P49146
Residue:
381
  
Inhibitor
Name:
BDBM61799
Synonyms:
MLS000088372 N-(2-chlorophenyl)-2,3,4,5,6-pentafluorobenzamide SMR000071736 | cid_2169782
Type:
Small organic molecule
Emp. Form.:
C13H5ClF5NO
Mol. Mass.:
321.63
SMILES:
Fc1c(F)c(F)c(C(=O)Nc2ccccc2Cl)c(F)c1F
: