Target
Neuropeptide Y receptor type 2
Ligand
BDBM61801
Substrate
Meas. Tech.
Fluorescence-based cell-based high-throughput dose response assay for agonists of NPY-Y2.
EC50
>35430±n/a nM
Citation
 PubChem, PC Fluorescence-based cell-based high-throughput dose response assay for agonists of NPY-Y2. PubChem Bioassay (2009)[AID] 
Target
Name:
Neuropeptide Y receptor type 2
Synonyms:
NPY-Y2 NPY2-R NPY2R_HUMAN Y2 receptor | neuropeptide Y receptor Y2
Type:
Enzyme Catalytic Domain
Mol. Mass.:
42734.65
Organism:
Homo sapiens (Human)
Description:
NPY-Y2 NPY2R HUMAN::P49146
Residue:
381
  
Inhibitor
Name:
BDBM61801
Synonyms:
3-Chloro-N-{2,2,2-trichloro-1-[3-(4-methoxy-2-nitro-phenyl)-thioureido]-ethyl}-benzamide 3-chloro-N-[2,2,2-trichloro-1-[(4-methoxy-2-nitro-phenyl)thiocarbamoylamino]ethyl]benzamide 3-chloro-N-[2,2,2-trichloro-1-[[(4-methoxy-2-nitroanilino)-sulfanylidenemethyl]amino]ethyl]benzamide SMR000116179 | cid_3093479
Type:
Small organic molecule
Emp. Form.:
C17H14Cl4N4O4S
Mol. Mass.:
512.194
SMILES:
COc1ccc(NC(=S)NC(NC(=O)c2cccc(Cl)c2)C(Cl)(Cl)Cl)c(c1)[N+]([O-])=O
: