Target
Neuropeptide Y receptor type 2
Ligand
BDBM61805
Substrate
Meas. Tech.
Fluorescence-based cell-based high-throughput dose response assay for agonists of NPY-Y2.
EC50
>35430±n/a nM
Citation
 PubChem, PC Fluorescence-based cell-based high-throughput dose response assay for agonists of NPY-Y2. PubChem Bioassay (2009)[AID] 
Target
Name:
Neuropeptide Y receptor type 2
Synonyms:
NPY-Y2 NPY2-R NPY2R_HUMAN Y2 receptor | neuropeptide Y receptor Y2
Type:
Enzyme Catalytic Domain
Mol. Mass.:
42734.65
Organism:
Homo sapiens (Human)
Description:
NPY-Y2 NPY2R HUMAN::P49146
Residue:
381
  
Inhibitor
Name:
BDBM61805
Synonyms:
1-(tert-butylamino)-3-(2,6-dimethylphenoxy)-2-propanol;hydrochloride MLS000564046 cid_5339088
Type:
Small organic molecule
Emp. Form.:
C15H25NO2
Mol. Mass.:
251.3645
SMILES:
Cc1cccc(C)c1OCC(O)CNC(C)(C)C
: