Target
Neuropeptide Y receptor type 2
Ligand
BDBM41606
Substrate
Meas. Tech.
Fluorescence-based cell-based high-throughput dose response assay for agonists of NPY-Y2.
EC50
31862±n/a nM
Citation
 PubChem, PC Fluorescence-based cell-based high-throughput dose response assay for agonists of NPY-Y2. PubChem Bioassay (2009)[AID] 
Target
Name:
Neuropeptide Y receptor type 2
Synonyms:
NPY-Y2 NPY2-R NPY2R_HUMAN Y2 receptor | neuropeptide Y receptor Y2
Type:
Enzyme Catalytic Domain
Mol. Mass.:
42734.65
Organism:
Homo sapiens (Human)
Description:
NPY-Y2 NPY2R HUMAN::P49146
Residue:
381
  
Inhibitor
Name:
BDBM41606
Synonyms:
MLS000324745 N-[1,1,1,3,3,3-hexakis(fluoranyl)-2-[(6-nitro-1,3-benzothiazol-2-yl)amino]propan-2-yl]benzamide N-[2,2,2-trifluoro-1-[(6-nitro-1,3-benzothiazol-2-yl)amino]-1-(trifluoromethyl)ethyl]benzamide cid_570353
Type:
Small organic molecule
Emp. Form.:
C17H10F6N4O3S
Mol. Mass.:
464.342
SMILES:
[O-][N+](=O)c1ccc2nc(NC(NC(=O)c3ccccc3)(C(F)(F)F)C(F)(F)F)sc2c1
: