Target
Neuropeptide Y receptor type 2
Ligand
BDBM48679
Substrate
Meas. Tech.
Fluorescence-based cell-based high-throughput dose response assay for agonists of NPY-Y2.
EC50
9923±n/a nM
Citation
 PubChem, PC Fluorescence-based cell-based high-throughput dose response assay for agonists of NPY-Y2. PubChem Bioassay (2009)[AID] 
Target
Name:
Neuropeptide Y receptor type 2
Synonyms:
NPY-Y2 NPY2-R NPY2R_HUMAN Y2 receptor | neuropeptide Y receptor Y2
Type:
Enzyme Catalytic Domain
Mol. Mass.:
42734.65
Organism:
Homo sapiens (Human)
Description:
NPY-Y2 NPY2R HUMAN::P49146
Residue:
381
  
Inhibitor
Name:
BDBM48679
Synonyms:
2-[(4-chlorophenyl)hydrazinylidene]-3-oxidanylidene-3-phenyl-propanenitrile 2-[(4-chlorophenyl)hydrazono]-3-keto-3-phenyl-propionitrile MLS000545160 SMR000163064 | cid_830566
Type:
Small organic molecule
Emp. Form.:
C15H10ClN3O
Mol. Mass.:
283.712
SMILES:
Clc1ccc(NN=C(C#N)C(=O)c2ccccc2)cc1
: