Target
Neuropeptide Y receptor type 2
Ligand
BDBM61817
Substrate
Meas. Tech.
Fluorescence-based cell-based high-throughput dose response assay for agonists of NPY-Y2.
EC50
>35430±n/a nM
Citation
 PubChem, PC Fluorescence-based cell-based high-throughput dose response assay for agonists of NPY-Y2. PubChem Bioassay (2009)[AID] 
Target
Name:
Neuropeptide Y receptor type 2
Synonyms:
NPY-Y2 NPY2-R NPY2R_HUMAN Y2 receptor | neuropeptide Y receptor Y2
Type:
Enzyme Catalytic Domain
Mol. Mass.:
42734.65
Organism:
Homo sapiens (Human)
Description:
NPY-Y2 NPY2R HUMAN::P49146
Residue:
381
  
Inhibitor
Name:
BDBM61817
Synonyms:
3-acenaphthen-5-yl-N-[(4-chloro-3-nitro-benzylidene)amino]-1H-pyrazole-5-carboxamide N-[(4-chloranyl-3-nitro-phenyl)methylideneamino]-3-(1,2-dihydroacenaphthylen-5-yl)-1H-pyrazole-5-carboxamide SMR000262214 | cid_2326206
Type:
Small organic molecule
Emp. Form.:
C23H16ClN5O3
Mol. Mass.:
445.858
SMILES:
[O-][N+](=O)c1cc(C=NNC(=O)c2cc(n[nH]2)-c2ccc3CCc4cccc2c34)ccc1Cl
: