Target
Neuropeptide Y receptor type 2
Ligand
BDBM61828
Substrate
Meas. Tech.
Fluorescence-based cell-based high-throughput dose response assay for agonists of NPY-Y2.
EC50
>35430±n/a nM
Citation
 PubChem, PC Fluorescence-based cell-based high-throughput dose response assay for agonists of NPY-Y2. PubChem Bioassay (2009)[AID] 
Target
Name:
Neuropeptide Y receptor type 2
Synonyms:
NPY-Y2 NPY2-R NPY2R_HUMAN Y2 receptor | neuropeptide Y receptor Y2
Type:
Enzyme Catalytic Domain
Mol. Mass.:
42734.65
Organism:
Homo sapiens (Human)
Description:
NPY-Y2 NPY2R HUMAN::P49146
Residue:
381
  
Inhibitor
Name:
BDBM61828
Synonyms:
2-(4-chloranylphenoxy)-N-(5-nitro-1,3-thiazol-2-yl)ethanamide 2-(4-chlorophenoxy)-N-(5-nitro-2-thiazolyl)acetamide MLS000708273 cid_3148028
Type:
Small organic molecule
Emp. Form.:
C11H8ClN3O4S
Mol. Mass.:
313.717
SMILES:
[O-][N+](=O)c1cnc(NC(=O)COc2ccc(Cl)cc2)s1
: