Target
Neuropeptide Y receptor type 2
Ligand
BDBM61829
Substrate
Meas. Tech.
Fluorescence-based cell-based high-throughput dose response assay for agonists of NPY-Y2.
EC50
>35430±n/a nM
Citation
 PubChem, PC Fluorescence-based cell-based high-throughput dose response assay for agonists of NPY-Y2. PubChem Bioassay (2009)[AID] 
Target
Name:
Neuropeptide Y receptor type 2
Synonyms:
NPY-Y2 NPY2-R NPY2R_HUMAN Y2 receptor | neuropeptide Y receptor Y2
Type:
Enzyme Catalytic Domain
Mol. Mass.:
42734.65
Organism:
Homo sapiens (Human)
Description:
NPY-Y2 NPY2R HUMAN::P49146
Residue:
381
  
Inhibitor
Name:
BDBM61829
Synonyms:
2-[1-(3,4-dimethoxyphenyl)tetrazol-5-yl]sulfanyl-N-(2-phenylethyl)acetamide 2-[[1-(3,4-dimethoxyphenyl)-5-tetrazolyl]thio]-N-(2-phenylethyl)acetamide MLS000712137 cid_1175629
Type:
Small organic molecule
Emp. Form.:
C19H21N5O3S
Mol. Mass.:
399.467
SMILES:
COc1ccc(cc1OC)-n1nnnc1SCC(=O)NCCc1ccccc1
: