Target
Neuropeptide Y receptor type 1
Ligand
BDBM37642
Substrate
Meas. Tech.
Fluorescence-based counterscreen for agonists of NPY-Y2: cell-based high-throughput dose response assay for agonists of NPY-Y1.
EC50
22043±n/a nM
Citation
 PubChem, PC Fluorescence-based counterscreen for agonists of NPY-Y2: cell-based high-throughput dose response assay for agonists of NPY-Y1. PubChem Bioassay (2009)[AID] 
Target
Name:
Neuropeptide Y receptor type 1
Synonyms:
NPY-Y1 NPY1R NPYR neuropeptide Y receptor Y1
Type:
Enzyme Catalytic Domain
Mol. Mass.:
44399.07
Organism:
Homo sapiens (Human)
Description:
NPY-Y1 NPY1R HUMAN::P25929
Residue:
384
  
Inhibitor
Name:
BDBM37642
Synonyms:
6-[4-(4-phenylquinazolin-2-yl)piperazin-1-yl]carbonylcyclohex-3-ene-1-carboxylic acid 6-[oxo-[4-(4-phenyl-2-quinazolinyl)-1-piperazinyl]methyl]-1-cyclohex-3-enecarboxylic acid SMR000041175 | cid_660299
Type:
Small organic molecule
Emp. Form.:
C26H26N4O3
Mol. Mass.:
442.5096
SMILES:
OC(=O)C1CC=CCC1C(=O)N1CCN(CC1)c1nc(-c2ccccc2)c2ccccc2n1
: