Target
Neuropeptide Y receptor type 1
Ligand
BDBM61800
Substrate
Meas. Tech.
Fluorescence-based counterscreen for agonists of NPY-Y2: cell-based high-throughput dose response assay for agonists of NPY-Y1.
EC50
12496±n/a nM
Citation
 PubChem, PC Fluorescence-based counterscreen for agonists of NPY-Y2: cell-based high-throughput dose response assay for agonists of NPY-Y1. PubChem Bioassay (2009)[AID] 
Target
Name:
Neuropeptide Y receptor type 1
Synonyms:
NPY-Y1 NPY1R NPYR neuropeptide Y receptor Y1
Type:
Enzyme Catalytic Domain
Mol. Mass.:
44399.07
Organism:
Homo sapiens (Human)
Description:
NPY-Y1 NPY1R HUMAN::P25929
Residue:
384
  
Inhibitor
Name:
BDBM61800
Synonyms:
1-(9-carbazolyl)-3-(diethylamino)-2-propanol MLS000104626 cid_56209
Type:
Small organic molecule
Emp. Form.:
C19H24N2O
Mol. Mass.:
296.4067
SMILES:
CCN(CC)CC(O)Cn1c2ccccc2c2ccccc12
: