Target
Neuropeptide Y receptor type 1
Ligand
BDBM41606
Substrate
Meas. Tech.
Fluorescence-based counterscreen for agonists of NPY-Y2: cell-based high-throughput dose response assay for agonists of NPY-Y1.
EC50
35337±n/a nM
Citation
 PubChem, PC Fluorescence-based counterscreen for agonists of NPY-Y2: cell-based high-throughput dose response assay for agonists of NPY-Y1. PubChem Bioassay (2009)[AID] 
Target
Name:
Neuropeptide Y receptor type 1
Synonyms:
NPY-Y1 NPY1R NPYR neuropeptide Y receptor Y1
Type:
Enzyme Catalytic Domain
Mol. Mass.:
44399.07
Organism:
Homo sapiens (Human)
Description:
NPY-Y1 NPY1R HUMAN::P25929
Residue:
384
  
Inhibitor
Name:
BDBM41606
Synonyms:
MLS000324745 N-[1,1,1,3,3,3-hexakis(fluoranyl)-2-[(6-nitro-1,3-benzothiazol-2-yl)amino]propan-2-yl]benzamide N-[2,2,2-trifluoro-1-[(6-nitro-1,3-benzothiazol-2-yl)amino]-1-(trifluoromethyl)ethyl]benzamide cid_570353
Type:
Small organic molecule
Emp. Form.:
C17H10F6N4O3S
Mol. Mass.:
464.342
SMILES:
[O-][N+](=O)c1ccc2nc(NC(NC(=O)c3ccccc3)(C(F)(F)F)C(F)(F)F)sc2c1
: