Target
Neuropeptide Y receptor type 1
Ligand
BDBM61816
Substrate
Meas. Tech.
Fluorescence-based counterscreen for agonists of NPY-Y2: cell-based high-throughput dose response assay for agonists of NPY-Y1.
EC50
>35430±n/a nM
Citation
 PubChem, PC Fluorescence-based counterscreen for agonists of NPY-Y2: cell-based high-throughput dose response assay for agonists of NPY-Y1. PubChem Bioassay (2009)[AID] 
Target
Name:
Neuropeptide Y receptor type 1
Synonyms:
NPY-Y1 NPY1R NPYR neuropeptide Y receptor Y1
Type:
Enzyme Catalytic Domain
Mol. Mass.:
44399.07
Organism:
Homo sapiens (Human)
Description:
NPY-Y1 NPY1R HUMAN::P25929
Residue:
384
  
Inhibitor
Name:
BDBM61816
Synonyms:
2-[1-(4-chlorobenzoyl)-5-methoxy-2-methyl-indol-3-yl]-N-(5-cyclopropyl-1,3,4-thiadiazol-2-yl)acetamide 2-[1-(4-chlorophenyl)carbonyl-5-methoxy-2-methyl-indol-3-yl]-N-(5-cyclopropyl-1,3,4-thiadiazol-2-yl)ethanamide MLS000416453 cid_2089534
Type:
Small organic molecule
Emp. Form.:
C24H21ClN4O3S
Mol. Mass.:
480.967
SMILES:
COc1ccc2n(C(=O)c3ccc(Cl)cc3)c(C)c(CC(=O)Nc3nnc(s3)C3CC3)c2c1
: