Target
Neuropeptide Y receptor type 1
Ligand
BDBM61822
Substrate
Meas. Tech.
Fluorescence-based counterscreen for agonists of NPY-Y2: cell-based high-throughput dose response assay for agonists of NPY-Y1.
EC50
>35430±n/a nM
Citation
 PubChem, PC Fluorescence-based counterscreen for agonists of NPY-Y2: cell-based high-throughput dose response assay for agonists of NPY-Y1. PubChem Bioassay (2009)[AID] 
Target
Name:
Neuropeptide Y receptor type 1
Synonyms:
NPY-Y1 NPY1R NPYR neuropeptide Y receptor Y1
Type:
Enzyme Catalytic Domain
Mol. Mass.:
44399.07
Organism:
Homo sapiens (Human)
Description:
NPY-Y1 NPY1R HUMAN::P25929
Residue:
384
  
Inhibitor
Name:
BDBM61822
Synonyms:
4-(4-morpholinyl)-8-nitroquinoline 4-(8-nitro-4-quinolyl)morpholine MLS000664902 cid_2960528
Type:
Small organic molecule
Emp. Form.:
C13H13N3O3
Mol. Mass.:
259.2606
SMILES:
[O-][N+](=O)c1cccc2c(ccnc12)N1CCOCC1
: