Target
Neuropeptide Y receptor type 1
Ligand
BDBM61837
Substrate
Meas. Tech.
Fluorescence-based counterscreen for agonists of NPY-Y2: cell-based high-throughput dose response assay for agonists of NPY-Y1.
EC50
16470±n/a nM
Citation
 PubChem, PC Fluorescence-based counterscreen for agonists of NPY-Y2: cell-based high-throughput dose response assay for agonists of NPY-Y1. PubChem Bioassay (2009)[AID] 
Target
Name:
Neuropeptide Y receptor type 1
Synonyms:
NPY-Y1 NPY1R NPYR neuropeptide Y receptor Y1
Type:
Enzyme Catalytic Domain
Mol. Mass.:
44399.07
Organism:
Homo sapiens (Human)
Description:
NPY-Y1 NPY1R HUMAN::P25929
Residue:
384
  
Inhibitor
Name:
BDBM61837
Synonyms:
4-[2-[(2,4-dipropoxyphenyl)methylidene]hydrazinyl]benzoic acid;sulfuric acid MLS000775216 cid_16196801
Type:
Small organic molecule
Emp. Form.:
C20H24N2O4
Mol. Mass.:
356.4156
SMILES:
CCCOc1ccc(CN=Nc2ccc(cc2)C(O)=O)c(OCCC)c1
: