Target
Neuropeptide Y receptor type 1
Ligand
BDBM61844
Substrate
Meas. Tech.
Fluorescence-based counterscreen for agonists of NPY-Y2: cell-based high-throughput dose response assay for agonists of NPY-Y1.
EC50
>35430±n/a nM
Citation
 PubChem, PC Fluorescence-based counterscreen for agonists of NPY-Y2: cell-based high-throughput dose response assay for agonists of NPY-Y1. PubChem Bioassay (2009)[AID] 
Target
Name:
Neuropeptide Y receptor type 1
Synonyms:
NPY-Y1 NPY1R NPYR neuropeptide Y receptor Y1
Type:
Enzyme Catalytic Domain
Mol. Mass.:
44399.07
Organism:
Homo sapiens (Human)
Description:
NPY-Y1 NPY1R HUMAN::P25929
Residue:
384
  
Inhibitor
Name:
BDBM61844
Synonyms:
8-(benzylthio)-7H-purine 8-(phenylmethylthio)-7H-purine MLS000736988 cid_236401
Type:
Small organic molecule
Emp. Form.:
C12H10N4S
Mol. Mass.:
242.3
SMILES:
C(Sc1nc2ncncc2[nH]1)c1ccccc1
: