Target
Procathepsin L
Ligand
BDBM59703
Substrate
Meas. Tech.
Counterscreen for inhibitors of M1 and M17 aminopeptidases: QFRET-based biochemical high throughput dose response assay for inhibitors of the Cathepsin L proteinase (CTSL1).
IC50
>59642±n/a nM
Citation
 PubChem, PC Counterscreen for inhibitors of M1 and M17 aminopeptidases: QFRET-based biochemical high throughput dose response assay for inhibitors of the Cathepsin L proteinase (CTSL1). PubChem Bioassay (2009)[AID] 
Target
Name:
Procathepsin L
Synonyms:
CATL1_HUMAN CTSL CTSL1 Cathepsin L Cathepsin L1 heavy chain MEP cathepsin L preproprotein
Type:
Enzyme
Mol. Mass.:
37557.19
Organism:
Homo sapiens (Human)
Description:
Purchased from Calbiochem (San Diego, CA).
Residue:
333
  
Inhibitor
Name:
BDBM59703
Synonyms:
MLS000052726 N-(4-bromo-3-chloro-phenyl)-2-[(6-keto-1H-pyrimidin-2-yl)thio]acetamide N-(4-bromo-3-chlorophenyl)-2-[(6-oxo-1H-pyrimidin-2-yl)sulfanyl]acetamide SMR000082487 | cid_2238183
Type:
Small organic molecule
Emp. Form.:
C12H9BrClN3O2S
Mol. Mass.:
374.641
SMILES:
Clc1cc(NC(=O)CSc2nccc(=O)[nH]2)ccc1Br
: