Target
Procathepsin L
Ligand
BDBM59817
Substrate
Meas. Tech.
Counterscreen for inhibitors of M1 and M17 aminopeptidases: QFRET-based biochemical high throughput dose response assay for inhibitors of the Cathepsin L proteinase (CTSL1).
IC50
>59642±n/a nM
Citation
 PubChem, PC Counterscreen for inhibitors of M1 and M17 aminopeptidases: QFRET-based biochemical high throughput dose response assay for inhibitors of the Cathepsin L proteinase (CTSL1). PubChem Bioassay (2009)[AID] 
Target
Name:
Procathepsin L
Synonyms:
CATL1_HUMAN CTSL CTSL1 Cathepsin L Cathepsin L1 heavy chain MEP cathepsin L preproprotein
Type:
Enzyme
Mol. Mass.:
37557.19
Organism:
Homo sapiens (Human)
Description:
Purchased from Calbiochem (San Diego, CA).
Residue:
333
  
Inhibitor
Name:
BDBM59817
Synonyms:
3-(3,4-dimethoxyphenyl)-1H-pyrazol-5-ol 5-(3,4-dimethoxyphenyl)-3-pyrazolin-3-one SMR000136146 | cid_613230
Type:
Small organic molecule
Emp. Form.:
C11H12N2O3
Mol. Mass.:
220.2246
SMILES:
COc1ccc(cc1OC)-c1cc(=O)[nH][nH]1
: