Target
Procathepsin L
Ligand
BDBM59829
Substrate
Meas. Tech.
Counterscreen for inhibitors of M1 and M17 aminopeptidases: QFRET-based biochemical high throughput dose response assay for inhibitors of the Cathepsin L proteinase (CTSL1).
IC50
>59642±n/a nM
Citation
 PubChem, PC Counterscreen for inhibitors of M1 and M17 aminopeptidases: QFRET-based biochemical high throughput dose response assay for inhibitors of the Cathepsin L proteinase (CTSL1). PubChem Bioassay (2009)[AID] 
Target
Name:
Procathepsin L
Synonyms:
CATL1_HUMAN CTSL CTSL1 Cathepsin L Cathepsin L1 heavy chain MEP cathepsin L preproprotein
Type:
Enzyme
Mol. Mass.:
37557.19
Organism:
Homo sapiens (Human)
Description:
Purchased from Calbiochem (San Diego, CA).
Residue:
333
  
Inhibitor
Name:
BDBM59829
Synonyms:
6-({[3-(methoxycarbonyl)-4,5-dimethyl-2-thienyl]amino}carbonyl)-3-cyclohexene-1-carboxylic acid 6-[(3-methoxycarbonyl-4,5-dimethyl-thiophen-2-yl)carbamoyl]cyclohex-3-ene-1-carboxylic acid 6-[[(3-methoxycarbonyl-4,5-dimethyl-2-thiophenyl)amino]-oxomethyl]-1-cyclohex-3-enecarboxylic acid SMR000136328 | cid_2933619
Type:
Small organic molecule
Emp. Form.:
C16H19NO5S
Mol. Mass.:
337.391
SMILES:
COC(=O)c1c(C)c(C)sc1NC(=O)C1CC=CCC1C(O)=O
: