Target
Procathepsin L
Ligand
BDBM53751
Substrate
Meas. Tech.
Counterscreen for inhibitors of M1 and M17 aminopeptidases: QFRET-based biochemical high throughput dose response assay for inhibitors of the Cathepsin L proteinase (CTSL1).
IC50
>59642±n/a nM
Citation
 PubChem, PC Counterscreen for inhibitors of M1 and M17 aminopeptidases: QFRET-based biochemical high throughput dose response assay for inhibitors of the Cathepsin L proteinase (CTSL1). PubChem Bioassay (2009)[AID] 
Target
Name:
Procathepsin L
Synonyms:
CATL1_HUMAN CTSL CTSL1 Cathepsin L Cathepsin L1 heavy chain MEP cathepsin L preproprotein
Type:
Enzyme
Mol. Mass.:
37557.19
Organism:
Homo sapiens (Human)
Description:
Purchased from Calbiochem (San Diego, CA).
Residue:
333
  
Inhibitor
Name:
BDBM53751
Synonyms:
1-(5-bromanylthiophen-2-yl)sulfonyl-N-[2-(cyclohexen-1-yl)ethyl]piperidine-4-carboxamide 1-[(5-bromo-2-thienyl)sulfonyl]-N-[2-(cyclohexen-1-yl)ethyl]isonipecotamide MLS000521720 cid_3317218
Type:
Small organic molecule
Emp. Form.:
C18H25BrN2O3S2
Mol. Mass.:
461.437
SMILES:
Brc1ccc(s1)S(=O)(=O)N1CCC(CC1)C(=O)NCCC1=CCCCC1
: