Target
Procathepsin L
Ligand
BDBM56450
Substrate
Meas. Tech.
Counterscreen for inhibitors of M1 and M17 aminopeptidases: QFRET-based biochemical high throughput dose response assay for inhibitors of the Cathepsin L proteinase (CTSL1).
IC50
>59642±n/a nM
Citation
 PubChem, PC Counterscreen for inhibitors of M1 and M17 aminopeptidases: QFRET-based biochemical high throughput dose response assay for inhibitors of the Cathepsin L proteinase (CTSL1). PubChem Bioassay (2009)[AID] 
Target
Name:
Procathepsin L
Synonyms:
CATL1_HUMAN CTSL CTSL1 Cathepsin L Cathepsin L1 heavy chain MEP cathepsin L preproprotein
Type:
Enzyme
Mol. Mass.:
37557.19
Organism:
Homo sapiens (Human)
Description:
Purchased from Calbiochem (San Diego, CA).
Residue:
333
  
Inhibitor
Name:
BDBM56450
Synonyms:
2-[[3-isopropoxycarbonyl-5-methyl-4-(p-tolyl)-2-thienyl]carbamoyl]-7-oxabicyclo[2.2.1]heptane-3-carboxylic acid 2-[[5-methyl-4-(4-methylphenyl)-3-propan-2-yloxycarbonylthiophen-2-yl]carbamoyl]-7-oxabicyclo[2.2.1]heptane-3-carboxylic acid 3-({[3-(isopropoxycarbonyl)-5-methyl-4-(4-methylphenyl)-2-thienyl]amino}carbonyl)-7-oxabicyclo[2.2.1]heptane-2-carboxylic acid SMR000162243 | cid_3466578
Type:
Small organic molecule
Emp. Form.:
C24H27NO6S
Mol. Mass.:
457.539
SMILES:
[H]C12CCC([H])(O1)C(C2C(O)=O)C(=O)Nc1sc(C)c(c1C(=O)OC(C)C)-c1ccc(C)cc1
: