Target
Procathepsin L
Ligand
BDBM60033
Substrate
Meas. Tech.
Counterscreen for inhibitors of M1 and M17 aminopeptidases: QFRET-based biochemical high throughput dose response assay for inhibitors of the Cathepsin L proteinase (CTSL1).
IC50
>59642±n/a nM
Citation
 PubChem, PC Counterscreen for inhibitors of M1 and M17 aminopeptidases: QFRET-based biochemical high throughput dose response assay for inhibitors of the Cathepsin L proteinase (CTSL1). PubChem Bioassay (2009)[AID] 
Target
Name:
Procathepsin L
Synonyms:
CATL1_HUMAN CTSL CTSL1 Cathepsin L Cathepsin L1 heavy chain MEP cathepsin L preproprotein
Type:
Enzyme
Mol. Mass.:
37557.19
Organism:
Homo sapiens (Human)
Description:
Purchased from Calbiochem (San Diego, CA).
Residue:
333
  
Inhibitor
Name:
BDBM60033
Synonyms:
MLS000390237 N-(1,5-dimethyl-3-oxo-2-phenyl-4-pyrazolyl)-2-[[5-(4-methylanilino)-1,3,4-thiadiazol-2-yl]thio]propanamide N-(3-keto-1,5-dimethyl-2-phenyl-3-pyrazolin-4-yl)-2-[[5-(p-toluidino)-1,3,4-thiadiazol-2-yl]thio]propionamide cid_4548579
Type:
Small organic molecule
Emp. Form.:
C23H24N6O2S2
Mol. Mass.:
480.606
SMILES:
CC(Sc1nnc(Nc2ccc(C)cc2)s1)C(=O)Nc1c(C)n(C)n(-c2ccccc2)c1=O
: