Target
Procathepsin L
Ligand
BDBM60041
Substrate
Meas. Tech.
Counterscreen for inhibitors of M1 and M17 aminopeptidases: QFRET-based biochemical high throughput dose response assay for inhibitors of the Cathepsin L proteinase (CTSL1).
IC50
>59642±n/a nM
Citation
 PubChem, PC Counterscreen for inhibitors of M1 and M17 aminopeptidases: QFRET-based biochemical high throughput dose response assay for inhibitors of the Cathepsin L proteinase (CTSL1). PubChem Bioassay (2009)[AID] 
Target
Name:
Procathepsin L
Synonyms:
CATL1_HUMAN CTSL CTSL1 Cathepsin L Cathepsin L1 heavy chain MEP cathepsin L preproprotein
Type:
Enzyme
Mol. Mass.:
37557.19
Organism:
Homo sapiens (Human)
Description:
Purchased from Calbiochem (San Diego, CA).
Residue:
333
  
Inhibitor
Name:
BDBM60041
Synonyms:
2-keto-1H-pyridine-3-carboxylic acid [2-[2,5-dimethyl-1-(p-tolyl)pyrrol-3-yl]-2-keto-ethyl] ester MLS000416852 [2-[2,5-dimethyl-1-(4-methylphenyl)pyrrol-3-yl]-2-oxidanylidene-ethyl] 2-oxidanylidene-1H-pyridine-3-carboxylate cid_2534595
Type:
Small organic molecule
Emp. Form.:
C21H20N2O4
Mol. Mass.:
364.3945
SMILES:
Cc1cc(C(=O)COC(=O)c2ccc[nH]c2=O)c(C)n1-c1ccc(C)cc1
: