Target
Procathepsin L
Ligand
BDBM60071
Substrate
Meas. Tech.
Counterscreen for inhibitors of M1 and M17 aminopeptidases: QFRET-based biochemical high throughput dose response assay for inhibitors of the Cathepsin L proteinase (CTSL1).
IC50
>59642±n/a nM
Citation
 PubChem, PC Counterscreen for inhibitors of M1 and M17 aminopeptidases: QFRET-based biochemical high throughput dose response assay for inhibitors of the Cathepsin L proteinase (CTSL1). PubChem Bioassay (2009)[AID] 
Target
Name:
Procathepsin L
Synonyms:
CATL1_HUMAN CTSL CTSL1 Cathepsin L Cathepsin L1 heavy chain MEP cathepsin L preproprotein
Type:
Enzyme
Mol. Mass.:
37557.19
Organism:
Homo sapiens (Human)
Description:
Purchased from Calbiochem (San Diego, CA).
Residue:
333
  
Inhibitor
Name:
BDBM60071
Synonyms:
6-[(3-cyano-4,5,6,7,8,9-hexahydrocycloocta[b]thiophen-2-yl)carbamoyl]cyclohex-3-ene-1-carboxylic acid 6-{[(3-cyano-4,5,6,7,8,9-hexahydrocycloocta[b]thien-2-yl)amino]carbonyl}-3-cyclohexene-1-carboxylic acid SMR000231237 | cid_3658937
Type:
Small organic molecule
Emp. Form.:
C19H22N2O3S
Mol. Mass.:
358.455
SMILES:
OC(=O)C1CC=CCC1C(=O)Nc1sc2CCCCCCc2c1C#N
: