Target
Procathepsin L
Ligand
BDBM60075
Substrate
Meas. Tech.
Counterscreen for inhibitors of M1 and M17 aminopeptidases: QFRET-based biochemical high throughput dose response assay for inhibitors of the Cathepsin L proteinase (CTSL1).
IC50
>59642±n/a nM
Citation
 PubChem, PC Counterscreen for inhibitors of M1 and M17 aminopeptidases: QFRET-based biochemical high throughput dose response assay for inhibitors of the Cathepsin L proteinase (CTSL1). PubChem Bioassay (2009)[AID] 
Target
Name:
Procathepsin L
Synonyms:
CATL1_HUMAN CTSL CTSL1 Cathepsin L Cathepsin L1 heavy chain MEP cathepsin L preproprotein
Type:
Enzyme
Mol. Mass.:
37557.19
Organism:
Homo sapiens (Human)
Description:
Purchased from Calbiochem (San Diego, CA).
Residue:
333
  
Inhibitor
Name:
BDBM60075
Synonyms:
3,4-dimethyl-6-[(3-nitroanilino)-oxomethyl]-1-cyclohex-3-enecarboxylic acid 6-({3-nitroanilino}carbonyl)-3,4-dimethyl-3-cyclohexene-1-carboxylic acid SMR000231331 | cid_4057021
Type:
Small organic molecule
Emp. Form.:
C16H18N2O5
Mol. Mass.:
318.3245
SMILES:
CC1=C(C)CC(C(C1)C(O)=O)C(=O)Nc1cccc(c1)[N+]([O-])=O
: