Target
Procathepsin L
Ligand
BDBM53950
Substrate
Meas. Tech.
Counterscreen for inhibitors of M1 and M17 aminopeptidases: QFRET-based biochemical high throughput dose response assay for inhibitors of the Cathepsin L proteinase (CTSL1).
IC50
>59642±n/a nM
Citation
 PubChem, PC Counterscreen for inhibitors of M1 and M17 aminopeptidases: QFRET-based biochemical high throughput dose response assay for inhibitors of the Cathepsin L proteinase (CTSL1). PubChem Bioassay (2009)[AID] 
Target
Name:
Procathepsin L
Synonyms:
CATL1_HUMAN CTSL CTSL1 Cathepsin L Cathepsin L1 heavy chain MEP cathepsin L preproprotein
Type:
Enzyme
Mol. Mass.:
37557.19
Organism:
Homo sapiens (Human)
Description:
Purchased from Calbiochem (San Diego, CA).
Residue:
333
  
Inhibitor
Name:
BDBM53950
Synonyms:
4-[(3Z)-3-(6-chloranyl-2-oxidanylidene-4-phenyl-quinolin-3-ylidene)-5-(4-methoxyphenyl)pyrazolidin-1-yl]-4-oxidanylidene-butanoic acid 4-[(3Z)-3-(6-chloro-2-oxo-4-phenyl-3-quinolinylidene)-5-(4-methoxyphenyl)-1-pyrazolidinyl]-4-oxobutanoic acid CHEMBL1529613 SMR000273052 | cid_5902780
Type:
Small organic molecule
Emp. Form.:
C29H24ClN3O5
Mol. Mass.:
529.971
SMILES:
COc1ccc(cc1)C1CC(=NN1C(=O)CCC(O)=O)c1c(-c2ccccc2)c2cc(Cl)ccc2[nH]c1=O
: