Target
Induced myeloid leukemia cell differentiation protein Mcl-1
Ligand
BDBM41228
Substrate
Meas. Tech.
Fluorescence polarization-based biochemical high throughput dose response assay for inhibitors of myeloid cell leukemia sequence 1 (MCL1) interactions with BIM-BH3 peptide.
IC50
>1343±n/a nM
Citation
 PubChem, PC Fluorescence polarization-based biochemical high throughput dose response assay for inhibitors of myeloid cell leukemia sequence 1 (MCL1) interactions with BIM-BH3 peptide. PubChem Bioassay (2009)[AID] 
Target
Name:
Induced myeloid leukemia cell differentiation protein Mcl-1
Synonyms:
BCL2L3 Bcl-2-like protein 3 (Mcl-1) Bcl2-L-3 MCL1 Mcl-1 Myeloid cell leukemia sequence 1 (BCL2-related) | mcl1/EAT
Type:
Membrane; Single-pass membrane protein
Mol. Mass.:
37332.87
Organism:
Homo sapiens (Human)
Description:
Q07820
Residue:
350
  
Inhibitor
Name:
BDBM41228
Synonyms:
2,3,5,6-tetrakis(2-furanyl)pyrazine 2,3,5,6-tetrakis(furan-2-yl)pyrazine SMR000065994 | cid_854635
Type:
Small organic molecule
Emp. Form.:
C20H12N2O4
Mol. Mass.:
344.3203
SMILES:
c1coc(c1)-c1nc(-c2ccco2)c(nc1-c1ccco1)-c1ccco1
: