Target
Induced myeloid leukemia cell differentiation protein Mcl-1
Ligand
BDBM61852
Substrate
Meas. Tech.
Fluorescence polarization-based biochemical high throughput dose response assay for inhibitors of myeloid cell leukemia sequence 1 (MCL1) interactions with BIM-BH3 peptide.
IC50
5161±n/a nM
Citation
 PubChem, PC Fluorescence polarization-based biochemical high throughput dose response assay for inhibitors of myeloid cell leukemia sequence 1 (MCL1) interactions with BIM-BH3 peptide. PubChem Bioassay (2009)[AID] 
Target
Name:
Induced myeloid leukemia cell differentiation protein Mcl-1
Synonyms:
BCL2L3 Bcl-2-like protein 3 (Mcl-1) Bcl2-L-3 MCL1 Mcl-1 Myeloid cell leukemia sequence 1 (BCL2-related) | mcl1/EAT
Type:
Membrane; Single-pass membrane protein
Mol. Mass.:
37332.87
Organism:
Homo sapiens (Human)
Description:
Q07820
Residue:
350
  
Inhibitor
Name:
BDBM61852
Synonyms:
MLS000050442 N-(2-furfuryl)-2-(4-keto-6-phenyl-thieno[2,3-d]pyrimidin-3-yl)acetamide N-(furan-2-ylmethyl)-2-(4-oxidanylidene-6-phenyl-thieno[2,3-d]pyrimidin-3-yl)ethanamide SMR000079735 | cid_1178171
Type:
Small organic molecule
Emp. Form.:
C19H15N3O3S
Mol. Mass.:
365.406
SMILES:
O=C(Cn1cnc2sc(cc2c1=O)-c1ccccc1)NCc1ccco1
: