Target
Induced myeloid leukemia cell differentiation protein Mcl-1
Ligand
BDBM34475
Substrate
Meas. Tech.
Fluorescence polarization-based biochemical high throughput dose response assay for inhibitors of myeloid cell leukemia sequence 1 (MCL1) interactions with BIM-BH3 peptide.
IC50
>447.75±n/a nM
Citation
 PubChem, PC Fluorescence polarization-based biochemical high throughput dose response assay for inhibitors of myeloid cell leukemia sequence 1 (MCL1) interactions with BIM-BH3 peptide. PubChem Bioassay (2009)[AID] 
Target
Name:
Induced myeloid leukemia cell differentiation protein Mcl-1
Synonyms:
BCL2L3 Bcl-2-like protein 3 (Mcl-1) Bcl2-L-3 MCL1 Mcl-1 Myeloid cell leukemia sequence 1 (BCL2-related) | mcl1/EAT
Type:
Membrane; Single-pass membrane protein
Mol. Mass.:
37332.87
Organism:
Homo sapiens (Human)
Description:
Q07820
Residue:
350
  
Inhibitor
Name:
BDBM34475
Synonyms:
9-bromanyl-4-oxidanyl-6H-chromeno[2,3-b]indol-3-one 9-bromo-4-hydroxy-6H-chromen[2,3-b]indol-3-one 9-bromochromeno[2,3-b]indole-3,4-diol SMR000075134 | cid_976141
Type:
Small organic molecule
Emp. Form.:
C15H8BrNO3
Mol. Mass.:
330.133
SMILES:
Oc1c2oc3[nH]c4ccc(Br)cc4c3cc2ccc1=O
: