Target
Induced myeloid leukemia cell differentiation protein Mcl-1
Ligand
BDBM40694
Substrate
Meas. Tech.
Fluorescence polarization-based biochemical high throughput dose response assay for inhibitors of myeloid cell leukemia sequence 1 (MCL1) interactions with BIM-BH3 peptide.
IC50
6802±n/a nM
Citation
 PubChem, PC Fluorescence polarization-based biochemical high throughput dose response assay for inhibitors of myeloid cell leukemia sequence 1 (MCL1) interactions with BIM-BH3 peptide. PubChem Bioassay (2009)[AID] 
Target
Name:
Induced myeloid leukemia cell differentiation protein Mcl-1
Synonyms:
BCL2L3 Bcl-2-like protein 3 (Mcl-1) Bcl2-L-3 MCL1 Mcl-1 Myeloid cell leukemia sequence 1 (BCL2-related) | mcl1/EAT
Type:
Membrane; Single-pass membrane protein
Mol. Mass.:
37332.87
Organism:
Homo sapiens (Human)
Description:
Q07820
Residue:
350
  
Inhibitor
Name:
BDBM40694
Synonyms:
2-(2-furanyl)-4-quinolinecarboxylic acid [2-[4-[2-furanyl(oxo)methyl]-1-piperazinyl]-2-oxoethyl] ester MLS000565090 [2-[4-(furan-2-carbonyl)piperazin-1-yl]-2-oxoethyl] 2-(furan-2-yl)quinoline-4-carboxylate cid_2434862
Type:
Small organic molecule
Emp. Form.:
C25H21N3O6
Mol. Mass.:
459.4507
SMILES:
O=C(COC(=O)c1cc(nc2ccccc12)-c1ccco1)N1CCN(CC1)C(=O)c1ccco1
: