Target
Induced myeloid leukemia cell differentiation protein Mcl-1
Ligand
BDBM61857
Substrate
Meas. Tech.
Fluorescence polarization-based biochemical high throughput dose response assay for inhibitors of myeloid cell leukemia sequence 1 (MCL1) interactions with BIM-BH3 peptide.
IC50
2697±n/a nM
Citation
 PubChem, PC Fluorescence polarization-based biochemical high throughput dose response assay for inhibitors of myeloid cell leukemia sequence 1 (MCL1) interactions with BIM-BH3 peptide. PubChem Bioassay (2009)[AID] 
Target
Name:
Induced myeloid leukemia cell differentiation protein Mcl-1
Synonyms:
BCL2L3 Bcl-2-like protein 3 (Mcl-1) Bcl2-L-3 MCL1 Mcl-1 Myeloid cell leukemia sequence 1 (BCL2-related) | mcl1/EAT
Type:
Membrane; Single-pass membrane protein
Mol. Mass.:
37332.87
Organism:
Homo sapiens (Human)
Description:
Q07820
Residue:
350
  
Inhibitor
Name:
BDBM61857
Synonyms:
7-nitro-5-(1-pyrrolidinylmethyl)-8-quinolinol 7-nitro-5-(pyrrolidinomethyl)quinolin-8-ol SMR000197129 | cid_690617
Type:
Small organic molecule
Emp. Form.:
C14H15N3O3
Mol. Mass.:
273.2872
SMILES:
Oc1c(cc(CN2CCCC2)c2cccnc12)[N+]([O-])=O
: