Target
Induced myeloid leukemia cell differentiation protein Mcl-1
Ligand
BDBM61859
Substrate
Meas. Tech.
Fluorescence polarization-based biochemical high throughput dose response assay for inhibitors of myeloid cell leukemia sequence 1 (MCL1) interactions with BIM-BH3 peptide.
IC50
>108803±n/a nM
Citation
 PubChem, PC Fluorescence polarization-based biochemical high throughput dose response assay for inhibitors of myeloid cell leukemia sequence 1 (MCL1) interactions with BIM-BH3 peptide. PubChem Bioassay (2009)[AID] 
Target
Name:
Induced myeloid leukemia cell differentiation protein Mcl-1
Synonyms:
BCL2L3 Bcl-2-like protein 3 (Mcl-1) Bcl2-L-3 MCL1 Mcl-1 Myeloid cell leukemia sequence 1 (BCL2-related) | mcl1/EAT
Type:
Membrane; Single-pass membrane protein
Mol. Mass.:
37332.87
Organism:
Homo sapiens (Human)
Description:
Q07820
Residue:
350
  
Inhibitor
Name:
BDBM61859
Synonyms:
2-(1-naphthalenylamino)-N'-[(E)-(6-oxo-5-prop-2-enyl-1-cyclohexa-2,4-dienylidene)methyl]acetohydrazide 2-(naphthalen-1-ylamino)-N'-[(E)-(6-oxo-5-prop-2-enylcyclohexa-2,4-dien-1-ylidene)methyl]acetohydrazide N'-[(1E)-(3-allyl-2-hydroxyphenyl)methylene]-2-(1-naphthylamino)acetohydrazide SMR000207411 | cid_5457940
Type:
Small organic molecule
Emp. Form.:
C22H21N3O2
Mol. Mass.:
359.421
SMILES:
Oc1c(CC=C)cccc1C=NNC(=O)CNc1cccc2ccccc12
: