Target
Induced myeloid leukemia cell differentiation protein Mcl-1
Ligand
BDBM50447
Substrate
Meas. Tech.
Fluorescence polarization-based biochemical high throughput dose response assay for inhibitors of myeloid cell leukemia sequence 1 (MCL1) interactions with BIM-BH3 peptide.
IC50
>4030±n/a nM
Citation
 PubChem, PC Fluorescence polarization-based biochemical high throughput dose response assay for inhibitors of myeloid cell leukemia sequence 1 (MCL1) interactions with BIM-BH3 peptide. PubChem Bioassay (2009)[AID] 
Target
Name:
Induced myeloid leukemia cell differentiation protein Mcl-1
Synonyms:
BCL2L3 Bcl-2-like protein 3 (Mcl-1) Bcl2-L-3 MCL1 Mcl-1 Myeloid cell leukemia sequence 1 (BCL2-related) | mcl1/EAT
Type:
Membrane; Single-pass membrane protein
Mol. Mass.:
37332.87
Organism:
Homo sapiens (Human)
Description:
Q07820
Residue:
350
  
Inhibitor
Name:
BDBM50447
Synonyms:
2-(4-bromoanilino)-6-nitro-1,3-benzothiazin-4-one 2-[(E)-4-Bromo-phenylimino]-6-nitro-2H-benzo[e][1,3]thiazin-4-ol SMR000217709 | cid_1420246
Type:
Small organic molecule
Emp. Form.:
C14H8BrN3O3S
Mol. Mass.:
378.201
SMILES:
[O-][N+](=O)c1ccc2s\c(=[NH+]\c3ccc(Br)cc3)[n-]c(=O)c2c1
: